Target
Fatty acid synthase
Ligand
BDBM50362887
Substrate
Meas. Tech.
ChEMBL_857804 (CHEMBL2169047)
IC50
6150±n/a nM
Citation
 Abramson, HN The lipogenesis pathway as a cancer target. J Med Chem 54:5615-38 (2011)  
Target
Name:
Fatty acid synthase
Synonyms:
FAS FAS_CHICK | Fatty acid synthase (FAS)
Type:
Enzyme
Mol. Mass.:
274770.36
Organism:
Gallus gallus (Chicken)
Description:
P12276
Residue:
2512
  
Inhibitor
Name:
BDBM50362887
Synonyms:
AVICULARIN
Type:
Small organic molecule
Emp. Form.:
C20H18O11
Mol. Mass.:
434.3503
SMILES:
OC[C@@H]1O[C@@H](Oc2c(O)c3c(cc(O)cc3=O)oc2-c2ccc(O)c(O)c2)[C@H](O)[C@H]1O
: