Target
Fatty acid synthase
Ligand
BDBM50394665
Substrate
Meas. Tech.
ChEMBL_857802 (CHEMBL2169045)
IC50
96800±n/a nM
Citation
 Abramson, HN The lipogenesis pathway as a cancer target. J Med Chem 54:5615-38 (2011)  
Target
Name:
Fatty acid synthase
Synonyms:
FAS FAS_HUMAN HU FASN
Type:
Enzyme
Mol. Mass.:
273419.37
Organism:
Homo sapiens (Human)
Description:
P49327
Residue:
2511
  
Inhibitor
Name:
BDBM50394665
Synonyms:
CHEMBL251750
Type:
Small organic molecule
Emp. Form.:
C10H12O2S
Mol. Mass.:
196.266
SMILES:
C\C(C=C)=C/[C@]1(C)SC(=O)CC1=O
: