Target
Fatty acid synthase
Ligand
BDBM50241313
Substrate
Meas. Tech.
ChEMBL_857801 (CHEMBL2169044)
IC50
>951000±n/a nM
Citation
 Abramson, HN The lipogenesis pathway as a cancer target. J Med Chem 54:5615-38 (2011)  
Target
Name:
Fatty acid synthase
Synonyms:
FAS_RAT | Fasn
Type:
PROTEIN
Mol. Mass.:
272640.19
Organism:
Rattus norvegicus
Description:
ChEMBL_940338
Residue:
2505
  
Inhibitor
Name:
BDBM50241313
Synonyms:
(5R)-4-hydroxy-3,5-dimethyl-5-[(1E)-2-methylbuta-1,3-dienyl]thiophen-2(5H)-one (R)-4-Hydroxy-3,5-dimethyl-5-((E)-2-methyl-buta-1,3-dienyl)-5H-thiophen-2-one 5R-Thiolactomycin TLM analog, 1
Type:
Small organic molecule
Emp. Form.:
C11H14O2S
Mol. Mass.:
210.293
SMILES:
CC1C(=O)S[C@](C)(\C=C(/C)C=C)C1=O
: