Target
Fatty acid synthase
Ligand
BDBM50009248
Substrate
Meas. Tech.
ChEMBL_857799 (CHEMBL2169042)
IC50
21860±n/a nM
Citation
 Abramson, HN The lipogenesis pathway as a cancer target. J Med Chem 54:5615-38 (2011)  
Target
Name:
Fatty acid synthase
Synonyms:
FAS FAS_HUMAN HU FASN
Type:
Enzyme
Mol. Mass.:
273419.37
Organism:
Homo sapiens (Human)
Description:
P49327
Residue:
2511
  
Inhibitor
Name:
BDBM50009248
Synonyms:
(2R,3S)-3-((4E,7E)-Nona-4,7-dienoyl)-oxirane-2-carboxylic acid amide 3-Nona-4,7-dienoyl-oxirane-2-carboxylic acid amide CERULENIN | CHEMBL45627
Type:
Small organic molecule
Emp. Form.:
C12H17NO3
Mol. Mass.:
223.2683
SMILES:
C\C=C\C\C=C\CCC(=O)[C@H]1O[C@H]1C(N)=O
: