Target
ATP-citrate synthase
Ligand
BDBM50394667
Substrate
Meas. Tech.
ChEMBL_857796 (CHEMBL2169039)
Ki
50000±n/a nM
Citation
 Abramson, HN The lipogenesis pathway as a cancer target. J Med Chem 54:5615-38 (2011)  
Target
Name:
ATP-citrate synthase
Synonyms:
ACLY_RAT | Acly
Type:
PROTEIN
Mol. Mass.:
120645.65
Organism:
Rattus norvegicus
Description:
ChEMBL_857791
Residue:
1100
  
Inhibitor
Name:
BDBM50394667
Synonyms:
CHEMBL2165253
Type:
Small organic molecule
Emp. Form.:
C6H6O7
Mol. Mass.:
190.1076
SMILES:
OC(=O)[C@H]1OC(=O)C[C@@]1(O)C(O)=O
: