Target
ATP-citrate synthase
Ligand
BDBM15361
Substrate
Meas. Tech.
ChEMBL_857794 (CHEMBL2169037)
Ki
7000±n/a nM
Citation
 Abramson, HN The lipogenesis pathway as a cancer target. J Med Chem 54:5615-38 (2011)  
Target
Name:
ATP-citrate synthase
Synonyms:
ACLY_RAT | Acly
Type:
PROTEIN
Mol. Mass.:
120645.65
Organism:
Rattus norvegicus
Description:
ChEMBL_857791
Residue:
1100
  
Inhibitor
Name:
BDBM15361
Synonyms:
(1aR,2Z,4E,14R,15aR)-8-chloro-9,11-dihydroxy-14-methyl-1a,14,15,15a-tetrahydro-6H-oxireno[e][2]benzoxacyclotetradecine-6,12(7H)-dione CHEMBL414883 Monorden | Radicicol
Type:
Antibiotic
Emp. Form.:
C18H17ClO6
Mol. Mass.:
364.777
SMILES:
[H][C@@]12C[C@@H](C)OC(=O)c3c(O)cc(O)c(Cl)c3CC(=O)C=CC=C[C@@]1([H])O2
: