Target
ATP-citrate synthase
Ligand
BDBM50394669
Substrate
Meas. Tech.
ChEMBL_857792 (CHEMBL2169035)
Ki
710±n/a nM
Citation
 Abramson, HN The lipogenesis pathway as a cancer target. J Med Chem 54:5615-38 (2011)  
Target
Name:
ATP-citrate synthase
Synonyms:
ACLY | ACLY_HUMAN
Type:
PROTEIN
Mol. Mass.:
120848.43
Organism:
Homo sapiens (Human)
Description:
ChEMBL_455196
Residue:
1101
  
Inhibitor
Name:
BDBM50394669
Synonyms:
CHEMBL2165264
Type:
Small organic molecule
Emp. Form.:
C23H26ClNO6
Mol. Mass.:
447.909
SMILES:
O[C@@H](CCCCCn1c2ccccc2c2cc(Cl)ccc12)C[C@@](O)(CC(O)=O)C(O)=O
: