Target
ATP-citrate synthase
Ligand
BDBM50394672
Substrate
Meas. Tech.
ChEMBL_857792 (CHEMBL2169035)
Ki
620±n/a nM
Citation
 Abramson, HN The lipogenesis pathway as a cancer target. J Med Chem 54:5615-38 (2011)  
Target
Name:
ATP-citrate synthase
Synonyms:
ACLY | ACLY_HUMAN
Type:
PROTEIN
Mol. Mass.:
120848.43
Organism:
Homo sapiens (Human)
Description:
ChEMBL_455196
Residue:
1101
  
Inhibitor
Name:
BDBM50394672
Synonyms:
CHEMBL2165259
Type:
Small organic molecule
Emp. Form.:
C18H24Cl2O7
Mol. Mass.:
423.285
SMILES:
O[C@@H](CCCCCCc1ccc(Cl)cc1Cl)C[C@@](O)([C@@H](O)C(O)=O)C(O)=O
: