Target
ATP-citrate synthase
Ligand
BDBM50394675
Substrate
Meas. Tech.
ChEMBL_857791 (CHEMBL2169034)
IC50
7000±n/a nM
Citation
 Abramson, HN The lipogenesis pathway as a cancer target. J Med Chem 54:5615-38 (2011)  
Target
Name:
ATP-citrate synthase
Synonyms:
ACLY_RAT | Acly
Type:
PROTEIN
Mol. Mass.:
120645.65
Organism:
Rattus norvegicus
Description:
ChEMBL_857791
Residue:
1100
  
Inhibitor
Name:
BDBM50394675
Synonyms:
PURPURONE
Type:
Small organic molecule
Emp. Form.:
C40H27NO11
Mol. Mass.:
697.6425
SMILES:
Oc1ccc(CCn2c3=C(C(=O)c4cc(O)c(O)cc4-c3c3-c4cc(O)c(O)cc4C(=O)C(c4ccc(O)c(O)c4)=c23)c2ccc(O)c(O)c2)cc1
: