Target
ATP-citrate synthase
Ligand
BDBM50368516
Substrate
Meas. Tech.
ChEMBL_857791 (CHEMBL2169034)
Ki
250000±n/a nM
Citation
 Abramson, HN The lipogenesis pathway as a cancer target. J Med Chem 54:5615-38 (2011)  
Target
Name:
ATP-citrate synthase
Synonyms:
ACLY_RAT | Acly
Type:
PROTEIN
Mol. Mass.:
120645.65
Organism:
Rattus norvegicus
Description:
ChEMBL_857791
Residue:
1100
  
Inhibitor
Name:
BDBM50368516
Synonyms:
CHEMBL1627232
Type:
Small organic molecule
Emp. Form.:
C6H11NO6S
Mol. Mass.:
225.22
SMILES:
CS(N)(=O)=C[C@@](O)(CC(O)=O)C(O)=O
: