Target
ATP-citrate synthase
Ligand
BDBM50394678
Substrate
Meas. Tech.
ChEMBL_857791 (CHEMBL2169034)
Ki
700±n/a nM
Citation
 Abramson, HN The lipogenesis pathway as a cancer target. J Med Chem 54:5615-38 (2011)  
Target
Name:
ATP-citrate synthase
Synonyms:
ACLY_RAT | Acly
Type:
PROTEIN
Mol. Mass.:
120645.65
Organism:
Rattus norvegicus
Description:
ChEMBL_857791
Residue:
1100
  
Inhibitor
Name:
BDBM50394678
Synonyms:
CHEMBL2165261
Type:
Small organic molecule
Emp. Form.:
C6H6F2O7
Mol. Mass.:
228.1044
SMILES:
OC(=O)C[C@](O)(C(O)=O)C(F)(F)C(O)=O
: