Target
ATP-citrate synthase
Ligand
BDBM50066683
Substrate
Meas. Tech.
ChEMBL_857791 (CHEMBL2169034)
Ki
1000±n/a nM
Citation
 Abramson, HN The lipogenesis pathway as a cancer target. J Med Chem 54:5615-38 (2011)  
Target
Name:
ATP-citrate synthase
Synonyms:
ACLY_RAT | Acly
Type:
PROTEIN
Mol. Mass.:
120645.65
Organism:
Rattus norvegicus
Description:
ChEMBL_857791
Residue:
1100
  
Inhibitor
Name:
BDBM50066683
Synonyms:
(S)-2-((R)-8-(2,4-dichlorophenyl)-2-hydroxyoctyl)-2-hydroxysuccinic acid CHEMBL119628
Type:
Small organic molecule
Emp. Form.:
C18H24Cl2O6
Mol. Mass.:
407.286
SMILES:
O[C@H](CCCCCCc1ccc(Cl)cc1Cl)C[C@](O)(CC(O)=O)C(O)=O
: