Target
Adenosine receptor A1
Ligand
BDBM50394716
Substrate
Meas. Tech.
ChEMBL_858813 (CHEMBL2167688)
Ki
29.3±n/a nM
Citation
 Shook, BCRassnick, SWallace, NCrooke, JAult, MChakravarty, DBarbay, JKWang, APowell, MTLeonard, KAlford, VScannevin, RHCarroll, KLampron, LWestover, LLim, HKRussell, RBranum, SWells, KMDamon, SYouells, SLi, XBeauchamp, DARhodes, KJackson, PF Design and characterization of optimized adenosine A2A/A1 receptor antagonists for the treatment of Parkinson's disease. J Med Chem 55:1402-17 (2012)  
Target
Name:
Adenosine receptor A1
Synonyms:
A1 adenosine receptor (hA1) AA1R_HUMAN ADORA1 Adenosine A1-receptor Adenosine receptor A1 (hA1) | Adenosine transporter (AdT)
Type:
G Protein-Coupled Receptor (GPCR)
Mol. Mass.:
36520.92
Organism:
Homo sapiens (Human)
Description:
P30542
Residue:
326
  
Inhibitor
Name:
BDBM50394716
Synonyms:
CHEMBL2165803
Type:
Small organic molecule
Emp. Form.:
C23H14F2N4O
Mol. Mass.:
400.3803
SMILES:
Nc1nc2-c3cc(ccc3C(=O)c2c(n1)-c1ccccc1)C(F)(F)c1cccnc1
: