Target
Lanosterol synthase
Ligand
BDBM50394835
Substrate
Meas. Tech.
ChEMBL_860118 (CHEMBL2168444)
IC50
7.8±n/a nM
Citation
 Staedler, DChapuis-Bernasconi, CDehmlow, HFischer, HJuillerat-Jeanneret, LAebi, JD Cytotoxic effects of combination of oxidosqualene cyclase inhibitors with atorvastatin in human cancer cells. J Med Chem 55:4990-5002 (2012)  
Target
Name:
Lanosterol synthase
Synonyms:
2,3-epoxysqualene--lanosterol cyclase LSS_HUMAN Oxidosqualene--lanosterol cyclase
Type:
PROTEIN
Mol. Mass.:
83309.32
Organism:
Homo sapiens (Human)
Description:
ChEMBL_11231
Residue:
732
  
Inhibitor
Name:
BDBM50394835
Synonyms:
CHEMBL2164235
Type:
Small organic molecule
Emp. Form.:
C23H33ClN2O2
Mol. Mass.:
404.973
SMILES:
CCCN(C)CCCC#C[C@H]1CC[C@@H](CC1)N(C)C(=O)Oc1ccc(Cl)cc1
: