Target
Solute carrier organic anion transporter family member 2B1
Ligand
BDBM50370232
Substrate
Meas. Tech.
ChEMBL_860288 (CHEMBL2169434)
Ki
63000±n/a nM
Citation
 Karlgren, MVildhede, ANorinder, UWisniewski, JRKimoto, ELai, YHaglund, UArtursson, P Classification of inhibitors of hepatic organic anion transporting polypeptides (OATPs): influence of protein expression on drug-drug interactions. J Med Chem 55:4740-63 (2012)  
Target
Name:
Solute carrier organic anion transporter family member 2B1
Synonyms:
KIAA0880 OATP-RP2 OATPB Organic anion transporter B SLC21A9 SO2B1_HUMAN | Solute carrier family 21 member 9
Type:
PROTEIN
Mol. Mass.:
76729.07
Organism:
Homo sapiens (Human)
Description:
ChEMBL_1488531
Residue:
709
  
Inhibitor
Name:
BDBM50370232
Synonyms:
BA-41166E RIFAMPIN Rifampicin
Type:
Small organic molecule
Emp. Form.:
C43H58N4O12
Mol. Mass.:
822.9402
SMILES:
CO[C@H]1\C=C\O[C@@]2(C)Oc3c(C2=O)c2c(O)c(\C=N\N4CCN(C)CC4)c(NC(=O)\C(C)=C/C=C/[C@H](C)[C@H](O)[C@@H](C)[C@@H](O)[C@@H](C)[C@H](OC(C)=O)[C@@H]1C)c(O)c2c(O)c3C
: