Target
Solute carrier organic anion transporter family member 2B1
Ligand
BDBM50394837
Substrate
Meas. Tech.
ChEMBL_860288 (CHEMBL2169434)
Ki
20000±n/a nM
Citation
 Karlgren, MVildhede, ANorinder, UWisniewski, JRKimoto, ELai, YHaglund, UArtursson, P Classification of inhibitors of hepatic organic anion transporting polypeptides (OATPs): influence of protein expression on drug-drug interactions. J Med Chem 55:4740-63 (2012)  
Target
Name:
Solute carrier organic anion transporter family member 2B1
Synonyms:
KIAA0880 OATP-RP2 OATPB Organic anion transporter B SLC21A9 SO2B1_HUMAN | Solute carrier family 21 member 9
Type:
PROTEIN
Mol. Mass.:
76729.07
Organism:
Homo sapiens (Human)
Description:
ChEMBL_1488531
Residue:
709
  
Inhibitor
Name:
BDBM50394837
Synonyms:
CHEMBL343002 | HOE-33342
Type:
Small organic molecule
Emp. Form.:
C27H28N6O
Mol. Mass.:
452.5508
SMILES:
CCOc1ccc(cc1)-c1nc2ccc(cc2[nH]1)-c1nc2ccc(cc2[nH]1)N1CCN(C)CC1
: