Target
Phosphatidylinositol 4,5-bisphosphate 3-kinase catalytic subunit delta isoform
Ligand
BDBM50394841
Substrate
Meas. Tech.
ChEMBL_860485 (CHEMBL2166654)
Ki
3±n/a nM
Citation
 Smith, ALD'Angelo, NDBo, YYBooker, SKCee, VJHerberich, BHong, FTJackson, CLLanman, BALiu, LNishimura, NPettus, LHReed, ABTadesse, STamayo, NAWurz, RPYang, KAndrews, KLWhittington, DAMcCarter, JDMiguel, TSZalameda, LJiang, JSubramanian, RMullady, ELCaenepeel, SFreeman, DJWang, LZhang, NWu, THughes, PENorman, MH Structure-based design of a novel series of potent, selective inhibitors of the class I phosphatidylinositol 3-kinases. J Med Chem 55:5188-219 (2012)  
Target
Name:
Phosphatidylinositol 4,5-bisphosphate 3-kinase catalytic subunit delta isoform
Synonyms:
PI3-kinase p110 subunit delta PI3-kinase subunit p110-delta PIK3CD Phosphatidylinositol 4,5-biphosphate 3-kinase catalytic subunit delta (PIK3CD) Phosphatidylinositol 4,5-bisphosphate 3-kinase 110 kDa catalytic subunit delta (PI3K delta) Phosphatidylinositol 4,5-bisphosphate 3-kinase catalytic subunit delta (PI3Kdelta) Phosphatidylinositol 4,5-bisphosphate 3-kinase catalytic subunit delta isoform (PI3K delta) Phosphatidylinositol 4,5-bisphosphate 3-kinase catalytic subunit delta isoform (PI3K-delta) Phosphatidylinositol 4,5-bisphosphate 3-kinase catalytic subunit delta isoform (PI3Kdelta)
Type:
Enzyme Subunit
Mol. Mass.:
119489.41
Organism:
Homo sapiens (Human)
Description:
O00329
Residue:
1044
  
Inhibitor
Name:
BDBM50394841
Synonyms:
CHEMBL2165004 | US8772480, 228
Type:
Small organic molecule
Emp. Form.:
C21H26N8O3S
Mol. Mass.:
470.548
SMILES:
COc1ccc(Nc2ncc(CN3CCC(C3)S(C)(=O)=O)cc2-c2nc(C)nc(N)n2)cn1
: