Target
Deoxyuridine 5'-triphosphate nucleotidohydrolase, mitochondrial
Ligand
BDBM50386598
Substrate
Meas. Tech.
ChEMBL_859059 (CHEMBL2169084)
IC50
1300±n/a nM
Citation
 Miyakoshi, HMiyahara, SYokogawa, TEndoh, KMuto, TYano, WWakasa, TUeno, HChong, KTTaguchi, JNomura, MTakao, YFujioka, AHashimoto, AItou, KYamamura, KShuto, SNagasawa, HFukuoka, M 1,2,3-Triazole-containing uracil derivatives with excellent pharmacokinetics as a novel class of potent human deoxyuridine triphosphatase inhibitors. J Med Chem 55:6427-37 (2012)  
Target
Name:
Deoxyuridine 5'-triphosphate nucleotidohydrolase, mitochondrial
Synonyms:
DUT Deoxyuridine 5'-triphosphate nucleotidohydrolase (dUTPase) dUTP pyrophosphatase
Type:
Enzyme
Mol. Mass.:
26574.03
Organism:
Homo sapiens (Human)
Description:
P33316
Residue:
252
  
Inhibitor
Name:
BDBM50386598
Synonyms:
CHEMBL2048463
Type:
Small organic molecule
Emp. Form.:
C23H25N3O3
Mol. Mass.:
391.4629
SMILES:
CN(CC(c1ccccc1)c1ccccc1)C(=O)CCCn1ccc(=O)[nH]c1=O
: