Target
Deoxyuridine 5'-triphosphate nucleotidohydrolase, mitochondrial
Ligand
BDBM50395056
Substrate
Meas. Tech.
ChEMBL_859059 (CHEMBL2169084)
IC50
740±n/a nM
Citation
 Miyakoshi, HMiyahara, SYokogawa, TEndoh, KMuto, TYano, WWakasa, TUeno, HChong, KTTaguchi, JNomura, MTakao, YFujioka, AHashimoto, AItou, KYamamura, KShuto, SNagasawa, HFukuoka, M 1,2,3-Triazole-containing uracil derivatives with excellent pharmacokinetics as a novel class of potent human deoxyuridine triphosphatase inhibitors. J Med Chem 55:6427-37 (2012)  
Target
Name:
Deoxyuridine 5'-triphosphate nucleotidohydrolase, mitochondrial
Synonyms:
DUT Deoxyuridine 5'-triphosphate nucleotidohydrolase (dUTPase) dUTP pyrophosphatase
Type:
Enzyme
Mol. Mass.:
26574.03
Organism:
Homo sapiens (Human)
Description:
P33316
Residue:
252
  
Inhibitor
Name:
BDBM50395056
Synonyms:
CHEMBL2163869
Type:
Small organic molecule
Emp. Form.:
C24H25N5O2
Mol. Mass.:
415.4876
SMILES:
O=c1ccn(CCCCc2cnnn2CC(c2ccccc2)c2ccccc2)c(=O)[nH]1
: