Target
Deoxyuridine 5'-triphosphate nucleotidohydrolase, mitochondrial
Ligand
BDBM50395042
Substrate
Meas. Tech.
ChEMBL_859059 (CHEMBL2169084)
IC50
>1000±n/a nM
Citation
 Miyakoshi, HMiyahara, SYokogawa, TEndoh, KMuto, TYano, WWakasa, TUeno, HChong, KTTaguchi, JNomura, MTakao, YFujioka, AHashimoto, AItou, KYamamura, KShuto, SNagasawa, HFukuoka, M 1,2,3-Triazole-containing uracil derivatives with excellent pharmacokinetics as a novel class of potent human deoxyuridine triphosphatase inhibitors. J Med Chem 55:6427-37 (2012)  
Target
Name:
Deoxyuridine 5'-triphosphate nucleotidohydrolase, mitochondrial
Synonyms:
DUT Deoxyuridine 5'-triphosphate nucleotidohydrolase (dUTPase) dUTP pyrophosphatase
Type:
Enzyme
Mol. Mass.:
26574.03
Organism:
Homo sapiens (Human)
Description:
P33316
Residue:
252
  
Inhibitor
Name:
BDBM50395042
Synonyms:
CHEMBL2163858
Type:
Small organic molecule
Emp. Form.:
C22H29N5O4
Mol. Mass.:
427.4968
SMILES:
CCOc1cccc(c1)[C@@](O)(CC)Cn1nncc1CCCCn1ccc(=O)[nH]c1=O
: