Target
Deoxyuridine 5'-triphosphate nucleotidohydrolase, mitochondrial
Ligand
BDBM50395045
Substrate
Meas. Tech.
ChEMBL_859059 (CHEMBL2169084)
IC50
720±n/a nM
Citation
 Miyakoshi, HMiyahara, SYokogawa, TEndoh, KMuto, TYano, WWakasa, TUeno, HChong, KTTaguchi, JNomura, MTakao, YFujioka, AHashimoto, AItou, KYamamura, KShuto, SNagasawa, HFukuoka, M 1,2,3-Triazole-containing uracil derivatives with excellent pharmacokinetics as a novel class of potent human deoxyuridine triphosphatase inhibitors. J Med Chem 55:6427-37 (2012)  
Target
Name:
Deoxyuridine 5'-triphosphate nucleotidohydrolase, mitochondrial
Synonyms:
DUT Deoxyuridine 5'-triphosphate nucleotidohydrolase (dUTPase) dUTP pyrophosphatase
Type:
Enzyme
Mol. Mass.:
26574.03
Organism:
Homo sapiens (Human)
Description:
P33316
Residue:
252
  
Inhibitor
Name:
BDBM50395045
Synonyms:
CHEMBL2163855
Type:
Small organic molecule
Emp. Form.:
C24H31N5O3
Mol. Mass.:
437.5346
SMILES:
CC[C@H](Cn1nncc1CCCCn1ccc(=O)[nH]c1=O)c1cccc(OCC2CC2)c1
: