Target
Inhibitor of nuclear factor kappa-B kinase subunit beta
Ligand
BDBM50395537
Substrate
Meas. Tech.
ChEMBL_858723 (CHEMBL2167034)
IC50
6.31±n/a nM
Citation
 Liddle, JBamborough, PBarker, MDCampos, SChung, CWCousins, RPFaulder, PHeathcote, MLHobbs, HHolmes, DSIoannou, CRamirez-Molina, CMorse, MAOsborn, RPayne, JJPritchard, JMRumsey, WLTape, DTVicentini, GWhitworth, CWilliamson, RA 4-Phenyl-7-azaindoles as potent, selective and bioavailable IKK2 inhibitors demonstrating good in vivo efficacy. Bioorg Med Chem Lett 22:5222-6 (2012)  
Target
Name:
Inhibitor of nuclear factor kappa-B kinase subunit beta
Synonyms:
I-kappa-B Kinase 2 (IKK-beta) I-kappa-B-kinase beta IKBKB IKK-beta IKK2/IKK1 IKKB_HUMAN Inhibitor of nuclear factor kappa B kinase beta subunit Nuclear factor NF-kappa-B inhibitor kinase beta
Type:
Serine/threonine-protein kinase
Mol. Mass.:
86554.39
Organism:
Homo sapiens (Human)
Description:
GST-tagged IKK-2 was expressed in High Five cells and purified.
Residue:
756
  
Inhibitor
Name:
BDBM50395537
Synonyms:
CHEMBL2164411
Type:
Small organic molecule
Emp. Form.:
C21H25N3O4S2
Mol. Mass.:
447.571
SMILES:
CC(C)c1cc2c(ccnc2[nH]1)-c1ccc(cc1)S(=O)(=O)NC1CCS(=O)(=O)CC1
: