Target
Protein kinase C iota type
Ligand
BDBM50395892
Substrate
Meas. Tech.
ChEMBL_858039 (CHEMBL2166775)
Ki
>1000000±n/a nM
Citation
 Tell, VHolzer, MHerrmann, LMahmoud, KASchächtele, CTotzke, FHilgeroth, A Multitargeted drug development: Discovery and profiling of dihydroxy substituted 1-aza-9-oxafluorenes as lead compounds targeting Alzheimer disease relevant kinases. Bioorg Med Chem Lett 22:6914-8 (2012)  
Target
Name:
Protein kinase C iota type
Synonyms:
Atypical protein kinase C-lambda/iota KPCI_HUMAN PRKCI Protein kinase C iota Protein kinase C iota type aPKC-lambda/iota | nPKC-iota
Type:
Enzyme
Mol. Mass.:
68251.56
Organism:
Homo sapiens (Human)
Description:
P41743
Residue:
596
  
Inhibitor
Name:
BDBM50395892
Synonyms:
CHEMBL2163772
Type:
Small organic molecule
Emp. Form.:
C17H11NO3
Mol. Mass.:
277.2741
SMILES:
Oc1ccc2oc3ncc(O)c(-c4ccccc4)c3c2c1
: