Target
Acetylcholinesterase
Ligand
BDBM50289102
Substrate
Meas. Tech.
ChEMBL_858575 (CHEMBL2166020)
IC50
11810±n/a nM
Citation
 Brunhofer, GFallarero, AKarlsson, DBatista-Gonzalez, AShinde, PGopi Mohan, CVuorela, P Exploration of natural compounds as sources of new bifunctional scaffolds targeting cholinesterases and beta amyloid aggregation: the case of chelerythrine. Bioorg Med Chem 20:6669-79 (2012)  
Target
Name:
Acetylcholinesterase
Synonyms:
ACES_ELEEL Acetylcholinesterase (EeAChE) | ache
Type:
Enzyme
Mol. Mass.:
71812.79
Organism:
Electrophorus electricus (Electric eel)
Description:
Residue:
633
  
Inhibitor
Name:
BDBM50289102
Synonyms:
1,2,3,9-Tetrahydro-pyrrolo[2,1-b]quinazoline CHEMBL355821
Type:
Small organic molecule
Emp. Form.:
C11H12N2
Mol. Mass.:
172.2264
SMILES:
C1CN2Cc3ccccc3N=C2C1
: