Target
Cholinesterase
Ligand
BDBM50396002
Substrate
Meas. Tech.
ChEMBL_858574 (CHEMBL2166019)
IC50
9010±n/a nM
Citation
 Brunhofer, GFallarero, AKarlsson, DBatista-Gonzalez, AShinde, PGopi Mohan, CVuorela, P Exploration of natural compounds as sources of new bifunctional scaffolds targeting cholinesterases and beta amyloid aggregation: the case of chelerythrine. Bioorg Med Chem 20:6669-79 (2012)  
Target
Name:
Cholinesterase
Synonyms:
Acylcholine acylhydrolase Butyrylcholine esterase (BChE) Butyrylcholinesterase (BuChE) CHLE_HUMAN Cholinesterases Pseudocholinesterase
Type:
Homotetramer
Mol. Mass.:
68422.27
Organism:
Homo sapiens (Human)
Description:
P06276
Residue:
602
  
Inhibitor
Name:
BDBM50396002
Synonyms:
CHEMBL2165597
Type:
Small organic molecule
Emp. Form.:
C20H25N3
Mol. Mass.:
307.4326
SMILES:
C1CN[C@H]2[C@@H](C1)[C@H]1CC[C@@H]2[C@H]2N1CCc1c2[nH]c2ccccc12
: