Target
Cholinesterase
Ligand
BDBM50396003
Substrate
Meas. Tech.
ChEMBL_858573 (CHEMBL2166018)
IC50
11390±n/a nM
Citation
 Brunhofer, GFallarero, AKarlsson, DBatista-Gonzalez, AShinde, PGopi Mohan, CVuorela, P Exploration of natural compounds as sources of new bifunctional scaffolds targeting cholinesterases and beta amyloid aggregation: the case of chelerythrine. Bioorg Med Chem 20:6669-79 (2012)  
Target
Name:
Cholinesterase
Synonyms:
BCHE CHLE_HORSE | Cholinesterase
Type:
Enzyme
Mol. Mass.:
65643.35
Organism:
Equus caballus (Horse)
Description:
P81908
Residue:
574
  
Inhibitor
Name:
BDBM50396003
Synonyms:
CHEMBL2165578
Type:
Small organic molecule
Emp. Form.:
C11H12N2O
Mol. Mass.:
188.2258
SMILES:
OC1N2CCCC2=Nc2ccccc12
: