Target
Cholinesterase
Ligand
BDBM50396003
Substrate
Meas. Tech.
ChEMBL_858574 (CHEMBL2166019)
IC50
>20000±n/a nM
Citation
 Brunhofer, GFallarero, AKarlsson, DBatista-Gonzalez, AShinde, PGopi Mohan, CVuorela, P Exploration of natural compounds as sources of new bifunctional scaffolds targeting cholinesterases and beta amyloid aggregation: the case of chelerythrine. Bioorg Med Chem 20:6669-79 (2012)  
Target
Name:
Cholinesterase
Synonyms:
Acylcholine acylhydrolase Butyrylcholine esterase (BChE) Butyrylcholinesterase (BuChE) CHLE_HUMAN Cholinesterases Pseudocholinesterase
Type:
Homotetramer
Mol. Mass.:
68422.27
Organism:
Homo sapiens (Human)
Description:
P06276
Residue:
602
  
Inhibitor
Name:
BDBM50396003
Synonyms:
CHEMBL2165578
Type:
Small organic molecule
Emp. Form.:
C11H12N2O
Mol. Mass.:
188.2258
SMILES:
OC1N2CCCC2=Nc2ccccc12
: