Target
Acetylcholinesterase
Ligand
BDBM25524
Substrate
Meas. Tech.
ChEMBL_858579 (CHEMBL2166024)
Ki
480±n/a nM
Citation
 Brunhofer, GFallarero, AKarlsson, DBatista-Gonzalez, AShinde, PGopi Mohan, CVuorela, P Exploration of natural compounds as sources of new bifunctional scaffolds targeting cholinesterases and beta amyloid aggregation: the case of chelerythrine. Bioorg Med Chem 20:6669-79 (2012)  
Target
Name:
Acetylcholinesterase
Synonyms:
ACES_ELEEL Acetylcholinesterase (EeAChE) | ache
Type:
Enzyme
Mol. Mass.:
71812.79
Organism:
Electrophorus electricus (Electric eel)
Description:
Residue:
633
  
Inhibitor
Name:
BDBM25524
Synonyms:
17,18-dimethoxy-21-methyl-5,7-dioxa-21-azapentacyclo[11.8.0.0^{2,10}.0^{4,8}.0^{14,19}]henicosa-1(13),2,4(8),9,11,14(19),15,17,20-nonaen-21-ium CHEMBL258893 Toddalin | chelerythrine
Type:
Small organic molecule
Emp. Form.:
C21H18NO4
Mol. Mass.:
348.3714
SMILES:
COc1ccc2c(c[n+](C)c3c4cc5OCOc5cc4ccc23)c1OC
: