Target
Acetylcholinesterase
Ligand
BDBM50292332
Substrate
Meas. Tech.
ChEMBL_858575 (CHEMBL2166020)
IC50
4070±n/a nM
Citation
 Brunhofer, GFallarero, AKarlsson, DBatista-Gonzalez, AShinde, PGopi Mohan, CVuorela, P Exploration of natural compounds as sources of new bifunctional scaffolds targeting cholinesterases and beta amyloid aggregation: the case of chelerythrine. Bioorg Med Chem 20:6669-79 (2012)  
Target
Name:
Acetylcholinesterase
Synonyms:
ACES_ELEEL Acetylcholinesterase (EeAChE) | ache
Type:
Enzyme
Mol. Mass.:
71812.79
Organism:
Electrophorus electricus (Electric eel)
Description:
Residue:
633
  
Inhibitor
Name:
BDBM50292332
Synonyms:
2,3,9,10-Tetramethoxy-5,6-dihydro-isoquino[3,2-a]isoquinolinylium; chloride CHEMBL1270849 CHEMBL274189 PALMATINE
Type:
Small organic molecule
Emp. Form.:
C21H22NO4
Mol. Mass.:
352.4031
SMILES:
COc1cc2CC[n+]3cc4c(OC)c(OC)ccc4cc3-c2cc1OC
: