Target
Acetylcholinesterase
Ligand
BDBM50076089
Substrate
Meas. Tech.
ChEMBL_858575 (CHEMBL2166020)
IC50
22720±n/a nM
Citation
 Brunhofer, GFallarero, AKarlsson, DBatista-Gonzalez, AShinde, PGopi Mohan, CVuorela, P Exploration of natural compounds as sources of new bifunctional scaffolds targeting cholinesterases and beta amyloid aggregation: the case of chelerythrine. Bioorg Med Chem 20:6669-79 (2012)  
Target
Name:
Acetylcholinesterase
Synonyms:
ACES_ELEEL Acetylcholinesterase (EeAChE) | ache
Type:
Enzyme
Mol. Mass.:
71812.79
Organism:
Electrophorus electricus (Electric eel)
Description:
Residue:
633
  
Inhibitor
Name:
BDBM50076089
Synonyms:
(3S,3aR,4R,4aS,8aR,9aS)-3-Methyl-4-[2-((R)-1-methyl-6-(S)-methyl-piperidin-2-yl)-vinyl]-decahydro-naphtho[2,3-c]furan-1-one (3S,3aR,4R,4aS,8aR,9aS)-4-[(E)-2-((2R,6S)-1,6-Dimethyl-piperidin-2-yl)-vinyl]-3-methyl-decahydro-naphtho[2,3-c]furan-1-one 4-[2-(1,6-Dimethyl-piperidin-2-yl)-vinyl]-3-methyl-decahydro-naphtho[2,3-c]furan-1-one CHEMBL277642
Type:
Small organic molecule
Emp. Form.:
C22H35NO2
Mol. Mass.:
345.5188
SMILES:
C[C@@H]1OC(=O)[C@H]2C[C@H]3CCCC[C@@H]3[C@@H](\C=C\[C@H]3CCC[C@H](C)N3C)[C@@H]12
: