Target
Cholinesterase
Ligand
BDBM50396005
Substrate
Meas. Tech.
ChEMBL_858574 (CHEMBL2166019)
IC50
1890±n/a nM
Citation
 Brunhofer, GFallarero, AKarlsson, DBatista-Gonzalez, AShinde, PGopi Mohan, CVuorela, P Exploration of natural compounds as sources of new bifunctional scaffolds targeting cholinesterases and beta amyloid aggregation: the case of chelerythrine. Bioorg Med Chem 20:6669-79 (2012)  
Target
Name:
Cholinesterase
Synonyms:
Acylcholine acylhydrolase Butyrylcholine esterase (BChE) Butyrylcholinesterase (BuChE) CHLE_HUMAN Cholinesterases Pseudocholinesterase
Type:
Homotetramer
Mol. Mass.:
68422.27
Organism:
Homo sapiens (Human)
Description:
P06276
Residue:
602
  
Inhibitor
Name:
BDBM50396005
Synonyms:
CHEMBL2163794
Type:
Small organic molecule
Emp. Form.:
C36H38N2O7
Mol. Mass.:
610.6961
SMILES:
COc1cc2CCN(C)[C@@H]3Cc4ccc(O)c(Oc5ccc(C[C@@H]6N(C)CCc7cc(OC)c(OO)c(Oc1cc23)c67)cc5)c4
: