Target
Cholinesterase
Ligand
BDBM50396006
Substrate
Meas. Tech.
ChEMBL_858574 (CHEMBL2166019)
IC50
2140±n/a nM
Citation
 Brunhofer, GFallarero, AKarlsson, DBatista-Gonzalez, AShinde, PGopi Mohan, CVuorela, P Exploration of natural compounds as sources of new bifunctional scaffolds targeting cholinesterases and beta amyloid aggregation: the case of chelerythrine. Bioorg Med Chem 20:6669-79 (2012)  
Target
Name:
Cholinesterase
Synonyms:
Acylcholine acylhydrolase Butyrylcholine esterase (BChE) Butyrylcholinesterase (BuChE) CHLE_HUMAN Cholinesterases Pseudocholinesterase
Type:
Homotetramer
Mol. Mass.:
68422.27
Organism:
Homo sapiens (Human)
Description:
P06276
Residue:
602
  
Inhibitor
Name:
BDBM50396006
Synonyms:
CHEMBL405686
Type:
Small organic molecule
Emp. Form.:
C44H43N3O9
Mol. Mass.:
757.8269
SMILES:
COc1cc2CCN(C)[C@H]3Cc4ccc(Oc5cc(C[C@H]6N(C)CCc7cc(OC)c(OC)c(Oc1cc23)c67)ccc5OC(=O)c1ccc(cc1)[N+]([O-])=O)cc4
: