Target
Cholinesterase
Ligand
BDBM50396007
Substrate
Meas. Tech.
ChEMBL_858574 (CHEMBL2166019)
IC50
19460±n/a nM
Citation
 Brunhofer, GFallarero, AKarlsson, DBatista-Gonzalez, AShinde, PGopi Mohan, CVuorela, P Exploration of natural compounds as sources of new bifunctional scaffolds targeting cholinesterases and beta amyloid aggregation: the case of chelerythrine. Bioorg Med Chem 20:6669-79 (2012)  
Target
Name:
Cholinesterase
Synonyms:
Acylcholine acylhydrolase Butyrylcholine esterase (BChE) Butyrylcholinesterase (BuChE) CHLE_HUMAN Cholinesterases Pseudocholinesterase
Type:
Homotetramer
Mol. Mass.:
68422.27
Organism:
Homo sapiens (Human)
Description:
P06276
Residue:
602
  
Inhibitor
Name:
BDBM50396007
Synonyms:
VERATRAMINE
Type:
Small organic molecule
Emp. Form.:
C27H39NO2
Mol. Mass.:
409.6041
SMILES:
C[C@H]([C@@H]1NC[C@@H](C)C[C@H]1O)c1ccc2[C@@H]3CC=C4C[C@@H](O)CC[C@]4(C)[C@H]3Cc2c1C
: