Target
Cholinesterase
Ligand
BDBM50396008
Substrate
Meas. Tech.
ChEMBL_858574 (CHEMBL2166019)
IC50
270±n/a nM
Citation
 Brunhofer, GFallarero, AKarlsson, DBatista-Gonzalez, AShinde, PGopi Mohan, CVuorela, P Exploration of natural compounds as sources of new bifunctional scaffolds targeting cholinesterases and beta amyloid aggregation: the case of chelerythrine. Bioorg Med Chem 20:6669-79 (2012)  
Target
Name:
Cholinesterase
Synonyms:
Acylcholine acylhydrolase Butyrylcholine esterase (BChE) Butyrylcholinesterase (BuChE) CHLE_HUMAN Cholinesterases Pseudocholinesterase
Type:
Homotetramer
Mol. Mass.:
68422.27
Organism:
Homo sapiens (Human)
Description:
P06276
Residue:
602
  
Inhibitor
Name:
BDBM50396008
Synonyms:
CHEMBL1512936
Type:
Small organic molecule
Emp. Form.:
C27H41NO3
Mol. Mass.:
427.6193
SMILES:
C[C@@H]1CC[C@H]2[C@H](C)[C@H]3CC[C@@]4(O)[C@@H]5CC(=O)[C@H]6CC(=O)CC[C@]6(C)[C@H]5C[C@H]4[C@@H]3CN2C1
: