Target
Cholinesterase
Ligand
BDBM50396011
Substrate
Meas. Tech.
ChEMBL_858573 (CHEMBL2166018)
IC50
4970±n/a nM
Citation
 Brunhofer, GFallarero, AKarlsson, DBatista-Gonzalez, AShinde, PGopi Mohan, CVuorela, P Exploration of natural compounds as sources of new bifunctional scaffolds targeting cholinesterases and beta amyloid aggregation: the case of chelerythrine. Bioorg Med Chem 20:6669-79 (2012)  
Target
Name:
Cholinesterase
Synonyms:
BCHE CHLE_HORSE | Cholinesterase
Type:
Enzyme
Mol. Mass.:
65643.35
Organism:
Equus caballus (Horse)
Description:
P81908
Residue:
574
  
Inhibitor
Name:
BDBM50396011
Synonyms:
CHEMBL327134
Type:
Small organic molecule
Emp. Form.:
C22H28N2O3
Mol. Mass.:
368.4693
SMILES:
CC[C@H]1CN2CCc3c([nH]c4ccccc34)[C@H]2C[C@@H]1\C(=C/OC)C(=O)OC
: