Target
Cholinesterase
Ligand
BDBM50289102
Substrate
Meas. Tech.
ChEMBL_858573 (CHEMBL2166018)
IC50
11940±n/a nM
Citation
 Brunhofer, GFallarero, AKarlsson, DBatista-Gonzalez, AShinde, PGopi Mohan, CVuorela, P Exploration of natural compounds as sources of new bifunctional scaffolds targeting cholinesterases and beta amyloid aggregation: the case of chelerythrine. Bioorg Med Chem 20:6669-79 (2012)  
Target
Name:
Cholinesterase
Synonyms:
BCHE CHLE_HORSE | Cholinesterase
Type:
Enzyme
Mol. Mass.:
65643.35
Organism:
Equus caballus (Horse)
Description:
P81908
Residue:
574
  
Inhibitor
Name:
BDBM50289102
Synonyms:
1,2,3,9-Tetrahydro-pyrrolo[2,1-b]quinazoline CHEMBL355821
Type:
Small organic molecule
Emp. Form.:
C11H12N2
Mol. Mass.:
172.2264
SMILES:
C1CN2Cc3ccccc3N=C2C1
: