Target
Beta-secretase 1
Ligand
BDBM50396104
Substrate
Meas. Tech.
ChEMBL_862050 (CHEMBL2174079)
IC50
69±n/a nM
Citation
 Hitchcock, SA Structural modifications that alter the P-glycoprotein efflux properties of compounds. J Med Chem 55:4877-95 (2012)  
Target
Name:
Beta-secretase 1
Synonyms:
ASP2 Aspartyl protease 2 BACE1 Beta-secretase (BACE) Beta-secretase 1 (BACE 1) Beta-secretase 1 (BACE1) Beta-site amyloid precursor protein cleaving enzyme 1 Memapsin-2 beta-Secretase (BACE-1) | beta-Secretase (BACE1)
Type:
Protein
Mol. Mass.:
55755.10
Organism:
Homo sapiens (Human)
Description:
P56817
Residue:
501
  
Inhibitor
Name:
BDBM50396104
Synonyms:
CHEMBL2171303
Type:
Small organic molecule
Emp. Form.:
C32H38F2N4O3
Mol. Mass.:
564.6659
SMILES:
CC(C)(C)Cc1cnc2OC3(CCC3)C[C@H](NC[C@@H](O)[C@H](Cc3ccc(F)cc3)NC(=O)c3cncc(F)c3)c2c1
: