Target
Cannabinoid receptor 2
Ligand
BDBM50396291
Substrate
Meas. Tech.
ChEMBL_863890 (CHEMBL2176374)
Ki
>1000±n/a nM
Citation
 Johnston, MBhatt, SRSikka, SMercier, RWWest, JMMakriyannis, AGatley, SJDuclos, RI Assay and inhibition of diacylglycerol lipase activity. Bioorg Med Chem Lett 22:4585-92 (2012)  
Target
Name:
Cannabinoid receptor 2
Synonyms:
CANNABINOID CB2 CB2 CB2B CNR2_HUMAN Cannabinoid CB2 receptor Cannabinoid receptor 2 (CB2R) | hCB2
Type:
G Protein-Coupled Receptor (GPCR)
Mol. Mass.:
39690.94
Organism:
Homo sapiens (Human)
Description:
P34972
Residue:
360
  
Inhibitor
Name:
BDBM50396291
Synonyms:
CHEMBL2172455
Type:
Small organic molecule
Emp. Form.:
C20H39NO4
Mol. Mass.:
357.528
SMILES:
CCCCCCCC(=O)NCC(COC)OC(=O)CCCCCCC
: