Target
Cannabinoid receptor 2
Ligand
BDBM50396286
Substrate
Meas. Tech.
ChEMBL_863891 (CHEMBL2176375)
Ki
>1000±n/a nM
Citation
 Johnston, MBhatt, SRSikka, SMercier, RWWest, JMMakriyannis, AGatley, SJDuclos, RI Assay and inhibition of diacylglycerol lipase activity. Bioorg Med Chem Lett 22:4585-92 (2012)  
Target
Name:
Cannabinoid receptor 2
Synonyms:
CANNABINOID CB2 CB2 Cannabinoid CB2 receptor Cannabinoid receptor 2 mCB2
Type:
Enzyme Catalytic Domain
Mol. Mass.:
38220.43
Organism:
MOUSE
Description:
P47936
Residue:
347
  
Inhibitor
Name:
BDBM50396286
Synonyms:
CHEMBL2172460
Type:
Small organic molecule
Emp. Form.:
C21H41NO5
Mol. Mass.:
387.5539
SMILES:
CCCCCCCCNC(=O)OCC(COC)OC(=O)CCCCCCC
: