Target
Mitogen-activated protein kinase 11
Ligand
BDBM50396845
Substrate
Meas. Tech.
ChEMBL_862226 (CHEMBL2172907)
IC50
36±n/a nM
Citation
 Asano, TYamazaki, HKasahara, CKubota, HKontani, THarayama, YOhno, KMizuhara, HYokomoto, MMisumi, KKinoshita, TOhta, MTakeuchi, M Identification, synthesis, and biological evaluation of 6-[(6R)-2-(4-fluorophenyl)-6-(hydroxymethyl)-4,5,6,7-tetrahydropyrazolo[1,5-a]pyrimidin-3-yl]-2-(2-methylphenyl)pyridazin-3(2H)-one (AS1940477), a potent p38 MAP kinase inhibitor. J Med Chem 55:7772-85 (2012)  
Target
Name:
Mitogen-activated protein kinase 11
Synonyms:
MAP kinase p38 MK11_HUMAN Mitogen-activated protein kinase p38 beta SAPK2 Stress-activated protein kinase 2 p38-2 p38b
Type:
Enzyme Catalytic Domain
Mol. Mass.:
41351.73
Organism:
Homo sapiens (Human)
Description:
gi_20128774
Residue:
364
  
Inhibitor
Name:
BDBM50396845
Synonyms:
CHEMBL2170294
Type:
Small organic molecule
Emp. Form.:
C24H22FN5O2
Mol. Mass.:
431.4622
SMILES:
Cc1ccccc1-n1nc(ccc1=O)-c1c2NC[C@@H](CO)Cn2nc1-c1ccc(F)cc1
: