Target
Potassium voltage-gated channel subfamily H member 2
Ligand
BDBM50396845
Substrate
Meas. Tech.
ChEMBL_862219 (CHEMBL2172900)
IC50
>100000±n/a nM
Citation
 Asano, TYamazaki, HKasahara, CKubota, HKontani, THarayama, YOhno, KMizuhara, HYokomoto, MMisumi, KKinoshita, TOhta, MTakeuchi, M Identification, synthesis, and biological evaluation of 6-[(6R)-2-(4-fluorophenyl)-6-(hydroxymethyl)-4,5,6,7-tetrahydropyrazolo[1,5-a]pyrimidin-3-yl]-2-(2-methylphenyl)pyridazin-3(2H)-one (AS1940477), a potent p38 MAP kinase inhibitor. J Med Chem 55:7772-85 (2012)  
Target
Name:
Potassium voltage-gated channel subfamily H member 2
Synonyms:
1,3-beta-glucan synthase component GLS2 ERG Eag-related protein 1 Ether-a-go-go-related gene (HERG) Ether-a-go-go-related gene potassium channel 1 Ether-a-go-go-related gene potassium channel 1 (hERG1) Ether-a-go-go-related protein 1 H-ERG KCNH2 Potassium voltage-gated channel subfamily H member 2 (hERG) Voltage-gated potassium channel subunit Kv11.1 hERG Potassium Channel 1 | putative potassium channel subunit
Type:
Multi-pass membrane protein
Mol. Mass.:
126672.65
Organism:
Homo sapiens (Human)
Description:
Q12809
Residue:
1159
  
Inhibitor
Name:
BDBM50396845
Synonyms:
CHEMBL2170294
Type:
Small organic molecule
Emp. Form.:
C24H22FN5O2
Mol. Mass.:
431.4622
SMILES:
Cc1ccccc1-n1nc(ccc1=O)-c1c2NC[C@@H](CO)Cn2nc1-c1ccc(F)cc1
: