Target
Cytochrome P450 2C9
Ligand
BDBM50396845
Substrate
Meas. Tech.
ChEMBL_862221 (CHEMBL2172902)
IC50
19000±n/a nM
Citation
 Asano, TYamazaki, HKasahara, CKubota, HKontani, THarayama, YOhno, KMizuhara, HYokomoto, MMisumi, KKinoshita, TOhta, MTakeuchi, M Identification, synthesis, and biological evaluation of 6-[(6R)-2-(4-fluorophenyl)-6-(hydroxymethyl)-4,5,6,7-tetrahydropyrazolo[1,5-a]pyrimidin-3-yl]-2-(2-methylphenyl)pyridazin-3(2H)-one (AS1940477), a potent p38 MAP kinase inhibitor. J Med Chem 55:7772-85 (2012)  
Target
Name:
Cytochrome P450 2C9
Synonyms:
(R)-limonene 6-monooxygenase CP2C9_HUMAN CYP2C9 Cytochrome P450 2C9 (CYP2C9 ) P-450MP P450 PB-1 | S-mephenytoin 4-hydroxylase
Type:
Enzyme
Mol. Mass.:
55636.33
Organism:
Homo sapiens (Human)
Description:
P11712
Residue:
490
  
Inhibitor
Name:
BDBM50396845
Synonyms:
CHEMBL2170294
Type:
Small organic molecule
Emp. Form.:
C24H22FN5O2
Mol. Mass.:
431.4622
SMILES:
Cc1ccccc1-n1nc(ccc1=O)-c1c2NC[C@@H](CO)Cn2nc1-c1ccc(F)cc1
: