Target
Cytochrome P450 1A2
Ligand
BDBM50396845
Substrate
Meas. Tech.
ChEMBL_862224 (CHEMBL2172905)
IC50
>50000±n/a nM
Citation
 Asano, TYamazaki, HKasahara, CKubota, HKontani, THarayama, YOhno, KMizuhara, HYokomoto, MMisumi, KKinoshita, TOhta, MTakeuchi, M Identification, synthesis, and biological evaluation of 6-[(6R)-2-(4-fluorophenyl)-6-(hydroxymethyl)-4,5,6,7-tetrahydropyrazolo[1,5-a]pyrimidin-3-yl]-2-(2-methylphenyl)pyridazin-3(2H)-one (AS1940477), a potent p38 MAP kinase inhibitor. J Med Chem 55:7772-85 (2012)  
Target
Name:
Cytochrome P450 1A2
Synonyms:
CP1A2_HUMAN CYPIA2 Cytochrome P(3)450 Cytochrome P450 1A2 (CYP1A2) Cytochrome P450-P3
Type:
Enzyme
Mol. Mass.:
58423.38
Organism:
Homo sapiens (Human)
Description:
P05177
Residue:
516
  
Inhibitor
Name:
BDBM50396845
Synonyms:
CHEMBL2170294
Type:
Small organic molecule
Emp. Form.:
C24H22FN5O2
Mol. Mass.:
431.4622
SMILES:
Cc1ccccc1-n1nc(ccc1=O)-c1c2NC[C@@H](CO)Cn2nc1-c1ccc(F)cc1
: