Target
Beta-secretase 1
Ligand
BDBM50226439
Substrate
Meas. Tech.
ChEMBL_864590 (CHEMBL2176639)
IC50
2490000±n/a nM
Citation
 Yonezawa, SYamamoto, TYamakawa, HMuto, CHosono, MHattori, KHigashino, KYutsudo, TIwamoto, HKondo, YSakagami, MTogame, HTanaka, YNakano, TTakemoto, HArisawa, MShuto, S Conformational restriction approach toß-secretase (BACE1) inhibitors: effect of a cyclopropane ring to induce an alternative binding mode. J Med Chem 55:8838-58 (2012)  
Target
Name:
Beta-secretase 1
Synonyms:
ASP2 Aspartyl protease 2 BACE1 Beta-secretase (BACE) Beta-secretase 1 (BACE 1) Beta-secretase 1 (BACE1) Beta-site amyloid precursor protein cleaving enzyme 1 Memapsin-2 beta-Secretase (BACE-1) | beta-Secretase (BACE1)
Type:
Protein
Mol. Mass.:
55755.10
Organism:
Homo sapiens (Human)
Description:
P56817
Residue:
501
  
Inhibitor
Name:
BDBM50226439
Synonyms:
2-amino-6-propylpyrimidin-4(3H)-one | CHEMBL235825
Type:
Small organic molecule
Emp. Form.:
C7H11N3O
Mol. Mass.:
153.1817
SMILES:
CCCc1cc(=O)[nH]c(N)n1
: