Target
Histone deacetylase 8
Ligand
BDBM50397364
Substrate
Meas. Tech.
ChEMBL_864759 (CHEMBL2175141)
IC50
47800±n/a nM
Citation
 Vaidya, ASNeelarapu, RMadriaga, ABai, HMendonca, EAbdelkarim, Hvan Breemen, RBBlond, SYPetukhov, PA Novel histone deacetylase 8 ligands without a zinc chelating group: exploring an 'upside-down' binding pose. Bioorg Med Chem Lett 22:6621-7 (2012)  
Target
Name:
Histone deacetylase 8
Synonyms:
HD8 HDAC8_HUMAN Histone deacetylase 8 (HDAC-8) | Human HDAC8
Type:
Enzyme
Mol. Mass.:
41749.60
Organism:
Homo sapiens (Human)
Description:
Q9BY41
Residue:
377
  
Inhibitor
Name:
BDBM50397364
Synonyms:
CHEMBL2170171
Type:
Small organic molecule
Emp. Form.:
C24H31NO4
Mol. Mass.:
397.5072
SMILES:
COC(=O)CCCCCCC(=O)Nc1ccc(OCc2cc(C)cc(C)c2)cc1
: