Target
Sigma non-opioid intracellular receptor 1
Ligand
BDBM50346390
Substrate
Meas. Tech.
ChEMBL_864760 (CHEMBL2175142)
Ki
>10000±n/a nM
Citation
 Köhler, JBergander, KFabian, JSchepmann, DWünsch, B Enantiomerically pure 1,3-dioxanes as highly selective NMDA ands1 receptor ligands. J Med Chem 55:8953-7 (2012)  
Target
Name:
Sigma non-opioid intracellular receptor 1
Synonyms:
OPRS1 SIGMAR1 Sigma non-opioid intracellular receptor 1 Sigma1-receptor Sterol isomerase-like protein
Type:
Protein
Mol. Mass.:
25307.17
Organism:
Cavia porcellus (Guinea pig)
Description:
Q60492
Residue:
223
  
Inhibitor
Name:
BDBM50346390
Synonyms:
CHEMBL1783455 | trans-2-(2-Ethyl-2-phenyl-1,3-dioxan-4-yl)ethan-1-amine
Type:
Small organic molecule
Emp. Form.:
C14H21NO2
Mol. Mass.:
235.322
SMILES:
CC[C@]1(OCC[C@@H](CCN)O1)c1ccccc1
: