Target
Sigma non-opioid intracellular receptor 1
Ligand
BDBM50397381
Substrate
Meas. Tech.
ChEMBL_864760 (CHEMBL2175142)
Ki
>10000±n/a nM
Citation
 Köhler, JBergander, KFabian, JSchepmann, DWünsch, B Enantiomerically pure 1,3-dioxanes as highly selective NMDA ands1 receptor ligands. J Med Chem 55:8953-7 (2012)  
Target
Name:
Sigma non-opioid intracellular receptor 1
Synonyms:
OPRS1 SIGMAR1 Sigma non-opioid intracellular receptor 1 Sigma1-receptor Sterol isomerase-like protein
Type:
Protein
Mol. Mass.:
25307.17
Organism:
Cavia porcellus (Guinea pig)
Description:
Q60492
Residue:
223
  
Inhibitor
Name:
BDBM50397381
Synonyms:
CHEMBL2170305
Type:
Small organic molecule
Emp. Form.:
C13H19NO2
Mol. Mass.:
221.2955
SMILES:
C[C@@]1(OCC[C@H](CCN)O1)c1ccccc1
: