Target
Histamine H1 receptor
Ligand
BDBM50397483
Substrate
Meas. Tech.
ChEMBL_862026 (CHEMBL2173976)
Ki
19.95±n/a nM
Citation
 Bahl, ABarton, PBowers, KBrough, SEvans, RLuckhurst, CAMochel, TPerry, MWRigby, ARiley, RJSanganee, HSisson, ASpringthorpe, B The discovery of CCR3/H1 dual antagonists with reduced hERG risk. Bioorg Med Chem Lett 22:6688-93 (2012)  
Target
Name:
Histamine H1 receptor
Synonyms:
H1R HISTAMINE H1 HRH1_HUMAN
Type:
G Protein-Coupled Receptor (GPCR)
Mol. Mass.:
55808.72
Organism:
Homo sapiens (Human)
Description:
Cell pellets from SK-N-MC cells transfected with human H1 receptor were used in binding assay.
Residue:
487
  
Inhibitor
Name:
BDBM50397483
Synonyms:
CHEMBL2171014
Type:
Small organic molecule
Emp. Form.:
C26H34Cl2N4O4S
Mol. Mass.:
569.544
SMILES:
CN(C)c1ccc(cc1)S(=O)(=O)NC(=O)N1CCC(CC1)N1CCC(CC1)Oc1ccc(Cl)c(C)c1Cl
: