Target
Cytochrome P450 2C19
Ligand
BDBM50398047
Substrate
Meas. Tech.
ChEMBL_873425 (CHEMBL2186100)
IC50
300±n/a nM
Citation
 Beaulieu, PLBös, MCordingley, MGChabot, CFazal, GGarneau, MGillard, JRJolicoeur, ELaPlante, SMcKercher, GPoirier, MPoupart, MATsantrizos, YSDuan, JKukolj, G Discovery of the first thumb pocket 1 NS5B polymerase inhibitor (BILB 1941) with demonstrated antiviral activity in patients chronically infected with genotype 1 hepatitis C virus (HCV). J Med Chem 55:7650-66 (2012)  
Target
Name:
Cytochrome P450 2C19
Synonyms:
(R)-limonene 6-monooxygenase (S)-limonene 7-monooxygenase CYP2C19 CYPIIC19 Cytochrome P450 2C19 [I331V] Cytochrome P450-254C Mephenytoin 4-hydroxylase P450-254C
Type:
Enzyme
Mol. Mass.:
55935.47
Organism:
Homo sapiens (Human)
Description:
P33261
Residue:
490
  
Inhibitor
Name:
BDBM50398047
Synonyms:
CHEMBL2181641
Type:
Small organic molecule
Emp. Form.:
C35H36N4O5
Mol. Mass.:
592.6841
SMILES:
COc1ccc(cn1)-c1c(C2CCCC2)c2ccc(cc2n1C)C(=O)NC1(CCC1)C(=O)Nc1ccc(\C=C\C(O)=O)cc1
: