Target
Cytochrome P450 2C19
Ligand
BDBM50398055
Substrate
Meas. Tech.
ChEMBL_873425 (CHEMBL2186100)
IC50
1400±n/a nM
Citation
 Beaulieu, PLBös, MCordingley, MGChabot, CFazal, GGarneau, MGillard, JRJolicoeur, ELaPlante, SMcKercher, GPoirier, MPoupart, MATsantrizos, YSDuan, JKukolj, G Discovery of the first thumb pocket 1 NS5B polymerase inhibitor (BILB 1941) with demonstrated antiviral activity in patients chronically infected with genotype 1 hepatitis C virus (HCV). J Med Chem 55:7650-66 (2012)  
Target
Name:
Cytochrome P450 2C19
Synonyms:
(R)-limonene 6-monooxygenase (S)-limonene 7-monooxygenase CYP2C19 CYPIIC19 Cytochrome P450 2C19 [I331V] Cytochrome P450-254C Mephenytoin 4-hydroxylase P450-254C
Type:
Enzyme
Mol. Mass.:
55935.47
Organism:
Homo sapiens (Human)
Description:
P33261
Residue:
490
  
Inhibitor
Name:
BDBM50398055
Synonyms:
CHEMBL2181789
Type:
Small organic molecule
Emp. Form.:
C33H33ClN4O4
Mol. Mass.:
585.093
SMILES:
Cn1c(c(C2CCCC2)c2ccc(cc12)C(=O)NC(C)(C)C(=O)Nc1ccc(\C=C\C(O)=O)cc1)-c1ccc(Cl)cn1
: